Reaction Details
TargetProtein kinase C theta type
LigandBDBM50391387
Substrate/Competitorn/a
Meas. Tech.ChEMBL_848579 (CHEMBL2148243)
Ki 2.9±n/a nM
Citation Kikumori, MYanagita, RCTokuda, HSuzuki, NNagai, HSuenaga, KIrie, K Structure-activity studies on the spiroketal moiety of a simplified analogue of debromoaplysiatoxin with antiproliferative activity. J Med Chem55:5614-26 (2012) 
 
Protein kinase C theta type
Name:Protein kinase C theta type
Type:Serine/threonine-protein kinase
Mol. Mass.:81878.04
Organism:Homo sapiens (Human)
Description:Full-length human PKC theta (Panvera Catalog No. P2996).
Residue:706
BDBM50391387
NameBDBM50391387
Synonyms:CHEMBL2148107
TypeSmall organic molecule
Emp. Form.C28H40O8
Mol. Mass.504.6124
SMILESC[C@@H]1CC(C)(C)[C@@]23C[C@@H](C[C@@H](CCCCc4cccc(O)c4)O2)OC(=O)C[C@H](CO)OC(=O)C[C@@H]1O3