Reaction Details
TargetReplicase polyprotein 1a
LigandBDBM50391429
Substrate/Competitorn/a
Meas. Tech.ChEMBL_848933 (CHEMBL2149727)
IC50 24800±n/a nM
Citation Park, JYKim, JHKim, YMJeong, HJKim, DWPark, KHKwon, HJPark, SJLee, WSRyu, YB Tanshinones as selective and slow-binding inhibitors for SARS-CoV cysteine proteases. Bioorg Med Chem20:5928-35 (2012) 
 
Replicase polyprotein 1a
Name:Replicase polyprotein 1a
Type:Enzyme
Mol. Mass.:486353.36
Organism:Human SARS coronavirus (SARS-CoV)
Description:P0C6U8
Residue:4382
BDBM50391429
NameBDBM50391429
Synonyms:CHEMBL215254 | acs.jmedchem.1c00409_ST.620
TypeSmall organic molecule
Emp. Form.C19H18O4
Mol. Mass.310.3438
SMILESCc1coc-2c1C(=O)C(=O)c1c3CCCC(C)(CO)c3ccc-21