Reaction Details
TargetReplicase polyprotein 1a
LigandBDBM50391431
Substrate/Competitorn/a
Meas. Tech.ChEMBL_848934 (CHEMBL2149728)
Ki 9700±n/a nM
Citation Park, JYKim, JHKim, YMJeong, HJKim, DWPark, KHKwon, HJPark, SJLee, WSRyu, YB Tanshinones as selective and slow-binding inhibitors for SARS-CoV cysteine proteases. Bioorg Med Chem20:5928-35 (2012) 
 
Replicase polyprotein 1a
Name:Replicase polyprotein 1a
Type:Enzyme
Mol. Mass.:486353.36
Organism:Human SARS coronavirus (SARS-CoV)
Description:P0C6U8
Residue:4382
BDBM50391431
NameBDBM50391431
Synonyms:CHEMBL2146517 | acs.jmedchem.1c00409_ST.502
TypeSmall organic molecule
Emp. Form.C20H18O5
Mol. Mass.338.3539
SMILESCOC(=O)[C@@]1(C)CCCc2c1ccc1-c3occ(C)c3C(=O)C(=O)c21