Reaction Details
TargetReplicase polyprotein 1a
LigandBDBM50423877
Substrate/Competitorn/a
Meas. Tech.ChEMBL_848932 (CHEMBL2149726)
IC50 4900±n/a nM
Citation Park, JYKim, JHKim, YMJeong, HJKim, DWPark, KHKwon, HJPark, SJLee, WSRyu, YB Tanshinones as selective and slow-binding inhibitors for SARS-CoV cysteine proteases. Bioorg Med Chem20:5928-35 (2012) 
 
Replicase polyprotein 1a
Name:Replicase polyprotein 1a
Type:Enzyme
Mol. Mass.:486353.36
Organism:Human SARS coronavirus (SARS-CoV)
Description:P0C6U8
Residue:4382
BDBM50423877
NameBDBM50423877
Synonyms:DIHYDROTANSHINONE acs.jmedchem.1c00409_ST.562
TypeSmall organic molecule
Emp. Form.C18H14O3
Mol. Mass.278.302
SMILESC[C@H]1COC2=C1C(=O)C(=O)c1c2ccc2c(C)cccc12