Reaction Details
TargetSodium channel protein type 9 subunit alpha
LigandBDBM50391513
Substrate/Competitorn/a
Meas. Tech.ChEMBL_849456 (CHEMBL2149457)
IC50 25±n/a nM
Citation Kers, IMacsari, ICsjernyik, GNylöf, MSkogholm, KSandberg, LMinidis, ABueters, TMalmborg, JEriksson, ABLund, PEVenyike, ELuo, LNyström, JEBesidski, Y Phenethyl nicotinamides, a novel class of Na(V)1.7 channel blockers: structure and activity relationship. Bioorg Med Chem Lett22:6108-15 (2012) 
 
Sodium channel protein type 9 subunit alpha
Name:Sodium channel protein type 9 subunit alpha
Type:Protein
Mol. Mass.:226375.97
Organism:Homo sapiens (Human)
Description:Q15858
Residue:1988
BDBM50391513
NameBDBM50391513
Synonyms:CHEMBL2147306
TypeSmall organic molecule
Emp. Form.C22H20F4N4O3
Mol. Mass.464.4128
SMILESCOc1ncc(cn1)-c1c(C)ccc(F)c1CCNC(=O)c1ccc(OCC(F)(F)F)nc1