Reaction Details
TargetPotassium voltage-gated channel subfamily H member 2
LigandBDBM50391488
Substrate/Competitorn/a
Meas. Tech.ChEMBL_849458 (CHEMBL2149459)
IC50 6310±n/a nM
Citation Kers, IMacsari, ICsjernyik, GNylöf, MSkogholm, KSandberg, LMinidis, ABueters, TMalmborg, JEriksson, ABLund, PEVenyike, ELuo, LNyström, JEBesidski, Y Phenethyl nicotinamides, a novel class of Na(V)1.7 channel blockers: structure and activity relationship. Bioorg Med Chem Lett22:6108-15 (2012) 
 
Potassium voltage-gated channel subfamily H member 2
Name:Potassium voltage-gated channel subfamily H member 2
Type:Multi-pass membrane protein
Mol. Mass.:126672.65
Organism:Homo sapiens (Human)
Description:Q12809
Residue:1159
BDBM50391488
NameBDBM50391488
Synonyms:CHEMBL2147225
TypeSmall organic molecule
Emp. Form.C23H23F3N4O4
Mol. Mass.476.4483
SMILESCOc1ccc(CCNC(=O)c2ccc(OCCC(F)(F)F)nc2)c(c1)-c1cnc(OC)nc1