Reaction Details
TargetSodium channel protein type 9 subunit alpha
LigandBDBM50391483
Substrate/Competitorn/a
Meas. Tech.ChEMBL_849456 (CHEMBL2149457)
IC50 32±n/a nM
Citation Kers, IMacsari, ICsjernyik, GNylöf, MSkogholm, KSandberg, LMinidis, ABueters, TMalmborg, JEriksson, ABLund, PEVenyike, ELuo, LNyström, JEBesidski, Y Phenethyl nicotinamides, a novel class of Na(V)1.7 channel blockers: structure and activity relationship. Bioorg Med Chem Lett22:6108-15 (2012) 
 
Sodium channel protein type 9 subunit alpha
Name:Sodium channel protein type 9 subunit alpha
Type:Protein
Mol. Mass.:226375.97
Organism:Homo sapiens (Human)
Description:Q15858
Residue:1988
BDBM50391483
NameBDBM50391483
Synonyms:CHEMBL2147223
TypeSmall organic molecule
Emp. Form.C22H20ClF3N4O3
Mol. Mass.480.867
SMILESCOc1ncc(cn1)-c1cccc(Cl)c1CCNC(=O)c1ccc(OCCC(F)(F)F)nc1