Reaction Details
TargetPotassium voltage-gated channel subfamily H member 2
LigandBDBM50391508
Substrate/Competitorn/a
Meas. Tech.ChEMBL_849458 (CHEMBL2149459)
IC50 25119±n/a nM
Citation Kers, IMacsari, ICsjernyik, GNylöf, MSkogholm, KSandberg, LMinidis, ABueters, TMalmborg, JEriksson, ABLund, PEVenyike, ELuo, LNyström, JEBesidski, Y Phenethyl nicotinamides, a novel class of Na(V)1.7 channel blockers: structure and activity relationship. Bioorg Med Chem Lett22:6108-15 (2012) 
 
Potassium voltage-gated channel subfamily H member 2
Name:Potassium voltage-gated channel subfamily H member 2
Type:Multi-pass membrane protein
Mol. Mass.:126672.65
Organism:Homo sapiens (Human)
Description:Q12809
Residue:1159
BDBM50391508
NameBDBM50391508
Synonyms:CHEMBL2147316
TypeSmall organic molecule
Emp. Form.C22H19F5N4O3
Mol. Mass.482.4033
SMILESCOc1cnc(cn1)-c1ccccc1C(F)(F)CNC(=O)c1ccc(COCC(F)(F)F)nc1