Reaction Details
TargetProthrombin
LigandBDBM50391540
Substrate/Competitorn/a
Meas. Tech.ChEMBL_849826 (CHEMBL2148453)
EC50 2100±n/a nM
Citation Anas, ARKisugi, TUmezawa, TMatsuda, FCampitelli, MRQuinn, RJOkino, T Thrombin inhibitors from the freshwater cyanobacterium Anabaena compacta. J Nat Prod75:1546-52 (2012) 
 
Prothrombin
Name:Prothrombin
Type:Enzyme
Mol. Mass.:70502.73
Organism:Bos taurus (Bovine)
Description:P00735
Residue:625
BDBM50391540
NameBDBM50391540
Synonyms:CHEMBL2147469
TypeSmall organic molecule
Emp. Form.C31H44N6O7
Mol. Mass.612.7171
SMILES[#6]-[#6@H]-1-[#6]-[#6@H](-[#7](-[#6]-1)-[#6](=O)-[#6@@H](-[#6]-[#6]-c1ccc(-[#8])cc1)-[#7]-[#6](=O)-[#6@H](-[#8])-[#6]-c1ccc(-[#8])cc1)-[#6](=O)-[#7]-[#6@H](-[#6]-[#8])-[#6]-[#6]-[#6]\[#7]=[#6](\[#7])-[#7]