Reaction Details
TargetInterleukin-5
LigandBDBM50391548
Substrate/Competitorn/a
Meas. Tech.ChEMBL_849854 (CHEMBL2148481)
IC50 9400±n/a nM
Citation Joo, CVenkateswararao, ELee, KCSharma, VKKyung, MSKim, YJung, SH Novel interleukin-5 inhibitors based on hydroxyethylaminomethyl-4H-chromen-4-one scaffold. Bioorg Med Chem20:5757-62 (2012) 
 
Interleukin-5
Name:Interleukin-5
Type:PROTEIN
Mol. Mass.:15414.97
Organism:Mus musculus
Description:ChEMBL_1464308
Residue:133
BDBM50391548
NameBDBM50391548
Synonyms:CHEMBL2147498
TypeSmall organic molecule
Emp. Form.C27H33NO4
Mol. Mass.435.5552
SMILESCc1ccc(CN(CCO)Cc2coc3cccc(OCC4CCCCC4)c3c2=O)cc1