Reaction Details
TargetInterleukin-5
LigandBDBM50391550
Substrate/Competitorn/a
Meas. Tech.ChEMBL_849854 (CHEMBL2148481)
IC50 12400±n/a nM
Citation Joo, CVenkateswararao, ELee, KCSharma, VKKyung, MSKim, YJung, SH Novel interleukin-5 inhibitors based on hydroxyethylaminomethyl-4H-chromen-4-one scaffold. Bioorg Med Chem20:5757-62 (2012) 
 
Interleukin-5
Name:Interleukin-5
Type:PROTEIN
Mol. Mass.:15414.97
Organism:Mus musculus
Description:ChEMBL_1464308
Residue:133
BDBM50391550
NameBDBM50391550
Synonyms:CHEMBL2147496
TypeSmall organic molecule
Emp. Form.C26H37NO4
Mol. Mass.427.5763
SMILESOCCN(CC1CCCCC1)Cc1coc2cccc(OCC3CCCCC3)c2c1=O