Reaction Details
TargetDipeptidyl peptidase 4
LigandBDBM50391576
Substrate/Competitorn/a
Meas. Tech.ChEMBL_850194 (CHEMBL2149800)
IC50 0.62±n/a nM
Citation Yoshida, TAkahoshi, FSakashita, HKitajima, HNakamura, MSonda, STakeuchi, MTanaka, YUeda, NSekiguchi, SIshige, TShima, KNabeno, MAbe, YAnabuki, JSoejima, AYoshida, KTakashina, YIshii, SKiuchi, SFukuda, STsutsumiuchi, RKosaka, KMurozono, TNakamaru, YUtsumi, HMasutomi, NKishida, HMiyaguchi, IHayashi, Y Discovery and preclinical profile of teneligliptin (3-[(2S,4S)-4-[4-(3-methyl-1-phenyl-1H-pyrazol-5-yl)piperazin-1-yl]pyrrolidin-2-ylcarbonyl]thiazolidine): a highly potent, selective, long-lasting and orally active dipeptidyl peptidase IV inhibitor for the treatment of type 2 diabetes. Bioorg Med Chem20:5705-19 (2012) 
 
Dipeptidyl peptidase 4
Name:Dipeptidyl peptidase 4
Type:Enzyme
Mol. Mass.:88271.01
Organism:Homo sapiens (Human)
Description:P27487
Residue:766
BDBM50391576
NameBDBM50391576
Synonyms:CHEMBL2147773
TypeSmall organic molecule
Emp. Form.C21H29N7OS
Mol. Mass.427.566
SMILESCc1cc(N2CCN(CC2)[C@@H]2CN[C@@H](C2)C(=O)N2CCSC2)n(n1)-c1cccnc1