Reaction Details
TargetDelta-type opioid receptor
LigandBDBM50391596
Substrate/Competitorn/a
Meas. Tech.ChEMBL_850392 (CHEMBL2150812)
Ki 0.34±n/a nM
Citation Ida, YMatsubara, ANemoto, TSaito, MHirayama, SFujii, HNagase, H Synthesis of quinolinomorphinan derivatives as highly selectived opioid receptor ligands. Bioorg Med Chem20:5810-31 (2012) 
 
Delta-type opioid receptor
Name:Delta-type opioid receptor
Type:Enzyme Catalytic Domain
Mol. Mass.:40577.25
Organism:MOUSE
Description:P32300
Residue:372
BDBM50391596
NameBDBM50391596
Synonyms:CHEMBL2147909
TypeSmall organic molecule
Emp. Form.C25H26N2O2
Mol. Mass.386.4861
SMILESCN1CC[C@]23Cc4nc5ccc(C)cc5cc4C[C@@]2(O)[C@H]1Cc1ccc(O)cc31