Reaction Details
TargetDelta-type opioid receptor
LigandBDBM50391605
Substrate/Competitorn/a
Meas. Tech.ChEMBL_850392 (CHEMBL2150812)
Ki 0.808±n/a nM
Citation Ida, YMatsubara, ANemoto, TSaito, MHirayama, SFujii, HNagase, H Synthesis of quinolinomorphinan derivatives as highly selectived opioid receptor ligands. Bioorg Med Chem20:5810-31 (2012) 
 
Delta-type opioid receptor
Name:Delta-type opioid receptor
Type:Enzyme Catalytic Domain
Mol. Mass.:40577.25
Organism:MOUSE
Description:P32300
Residue:372
BDBM50391605
NameBDBM50391605
Synonyms:CHEMBL2147918
TypeSmall organic molecule
Emp. Form.C25H26N2O3
Mol. Mass.402.4855
SMILESCOc1ccc2cc3C[C@@]4(O)[C@H]5Cc6ccc(O)cc6[C@@]4(CCN5C)Cc3nc2c1