Reaction Details
TargetDelta-type opioid receptor
LigandBDBM50391579
Substrate/Competitorn/a
Meas. Tech.ChEMBL_850392 (CHEMBL2150812)
Ki 0.344±n/a nM
Citation Ida, YMatsubara, ANemoto, TSaito, MHirayama, SFujii, HNagase, H Synthesis of quinolinomorphinan derivatives as highly selectived opioid receptor ligands. Bioorg Med Chem20:5810-31 (2012) 
 
Delta-type opioid receptor
Name:Delta-type opioid receptor
Type:Enzyme Catalytic Domain
Mol. Mass.:40577.25
Organism:MOUSE
Description:P32300
Residue:372
BDBM50391579
NameBDBM50391579
Synonyms:CHEMBL2147924
TypeSmall organic molecule
Emp. Form.C24H23N3O4
Mol. Mass.417.4571
SMILESCN1CC[C@]23Cc4nc5cccc([N+]([O-])=O)c5cc4C[C@@]2(O)[C@H]1Cc1ccc(O)cc31