Reaction Details
TargetAlpha-1B adrenergic receptor
LigandBDBM50391698
Substrate/Competitorn/a
Meas. Tech.ChEMBL_848015 (CHEMBL2150566)
Ki 10±n/a nM
Citation Procopiou, PABrowning, CGore, PMLynn, SMRichards, SASlack, RJSollis, SL Synthesis and pharmacological investigation of azaphthalazinone human histamine H(1) receptor antagonists. Bioorg Med Chem20:6097-108 (2012) 
 
Alpha-1B adrenergic receptor
Name:Alpha-1B adrenergic receptor
Type:Enzyme
Mol. Mass.:56862.13
Organism:Homo sapiens (Human)
Description:P35368
Residue:520
BDBM50391698
NameBDBM50391698
Synonyms:CHEMBL2146801
TypeSmall organic molecule
Emp. Form.C22H25ClN4O2
Mol. Mass.412.913
SMILESCOCCN1CCC[C@@H]1Cn1nc(Cc2ccc(Cl)cc2)c2cnccc2c1=O