Reaction Details
TargetAlpha-1B adrenergic receptor
LigandBDBM50391708
Substrate/Competitorn/a
Meas. Tech.ChEMBL_848015 (CHEMBL2150566)
Ki 10±n/a nM
Citation Procopiou, PABrowning, CGore, PMLynn, SMRichards, SASlack, RJSollis, SL Synthesis and pharmacological investigation of azaphthalazinone human histamine H(1) receptor antagonists. Bioorg Med Chem20:6097-108 (2012) 
 
Alpha-1B adrenergic receptor
Name:Alpha-1B adrenergic receptor
Type:Enzyme
Mol. Mass.:56862.13
Organism:Homo sapiens (Human)
Description:P35368
Residue:520
BDBM50391708
NameBDBM50391708
Synonyms:CHEMBL1767136
TypeSmall organic molecule
Emp. Form.C21H22ClN3O
Mol. Mass.367.872
SMILESCN1CCC[C@@H]1Cn1nc(Cc2ccc(Cl)cc2)c2ccccc2c1=O