Reaction Details
TargetAlpha-1A adrenergic receptor
LigandBDBM50341447
Substrate/Competitorn/a
Meas. Tech.ChEMBL_848012 (CHEMBL2150563)
Ki 39.81±n/a nM
Citation Procopiou, PABrowning, CGore, PMLynn, SMRichards, SASlack, RJSollis, SL Synthesis and pharmacological investigation of azaphthalazinone human histamine H(1) receptor antagonists. Bioorg Med Chem20:6097-108 (2012) 
 
Alpha-1A adrenergic receptor
Name:Alpha-1A adrenergic receptor
Type:Cell-surface receptors
Mol. Mass.:51511.67
Organism:Homo sapiens (Human)
Description:P35348
Residue:466
BDBM50341447
NameBDBM50341447
Synonyms:4-[(4-Chlorophenyl)methyl]-2-({(2R)-1-[4-(4-{[3-(hexahydro-1H-azepin-1-yl)propyl]oxy}phenyl)butyl]-2-pyrrolidinyl}methyl)-1(2H)-phthalazinone | CHEMBL1767164
TypeSmall organic molecule
Emp. Form.C39H49ClN4O2
Mol. Mass.641.285
SMILESClc1ccc(Cc2nn(C[C@H]3CCCN3CCCCc3ccc(OCCCN4CCCCCC4)cc3)c(=O)c3ccccc23)cc1