Reaction Details
TargetPotassium voltage-gated channel subfamily H member 2
LigandBDBM50391708
Substrate/Competitorn/a
Meas. Tech.ChEMBL_848013 (CHEMBL2150564)
IC50 200±n/a nM
Citation Procopiou, PABrowning, CGore, PMLynn, SMRichards, SASlack, RJSollis, SL Synthesis and pharmacological investigation of azaphthalazinone human histamine H(1) receptor antagonists. Bioorg Med Chem20:6097-108 (2012) 
 
Potassium voltage-gated channel subfamily H member 2
Name:Potassium voltage-gated channel subfamily H member 2
Type:Multi-pass membrane protein
Mol. Mass.:126672.65
Organism:Homo sapiens (Human)
Description:Q12809
Residue:1159
BDBM50391708
NameBDBM50391708
Synonyms:CHEMBL1767136
TypeSmall organic molecule
Emp. Form.C21H22ClN3O
Mol. Mass.367.872
SMILESCN1CCC[C@@H]1Cn1nc(Cc2ccc(Cl)cc2)c2ccccc2c1=O