Reaction Details
TargetCytochrome P450 26A1
LigandBDBM50391721
Substrate/Competitorn/a
Meas. Tech.ChEMBL_848138 (CHEMBL2148657)
IC50 16±n/a nM
Citation Gomaa, MSLim, ASLau, SCWatts, AMIllingworth, NABridgens, CEVeal, GJRedfern, CPBrancale, AArmstrong, JLSimons, C Synthesis and CYP26A1 inhibitory activity of novel methyl 3-[4-(arylamino)phenyl]-3-(azole)-2,2-dimethylpropanoates. Bioorg Med Chem20:6080-8 (2012) 
 
Cytochrome P450 26A1
Name:Cytochrome P450 26A1
Type:Enzyme
Mol. Mass.:56216.16
Organism:Homo sapiens (Human)
Description:O43174
Residue:497
BDBM50391721
NameBDBM50391721
Synonyms:CHEMBL2146980
TypeSmall organic molecule
Emp. Form.C22H25N3O2
Mol. Mass.363.4528
SMILESCOC(=O)C(C)(C)C(c1ccc(Nc2ccc(C)cc2)cc1)n1ccnc1