Reaction Details
TargetCalcium/calmodulin-dependent protein kinase type II subunit alpha
LigandBDBM50059989
Substrate/Competitorn/a
Meas. Tech.ChEMBL_848197 (CHEMBL2148933)
IC50 37000±n/a nM
Citation Mayadevi, MSherin, DRKeerthi, VSRajasekharan, KNOmkumar, RV Curcumin is an inhibitor of calcium/calmodulin dependent protein kinase II. Bioorg Med Chem20:6040-7 (2012) 
 
Calcium/calmodulin-dependent protein kinase type II subunit alpha
Name:Calcium/calmodulin-dependent protein kinase type II subunit alpha
Type:Enzyme Catalytic Domain
Mol. Mass.:54093.63
Organism:Homo sapiens (Human)
Description:gi_25952118
Residue:478
BDBM50059989
NameBDBM50059989
Synonyms:(1E,4Z,6E)-5-Hydroxy-1,7-bis-(4-hydroxy-phenyl)-hepta-1,4,6-trien-3-one 1,7-bis(4-hydroxyphenyl)-1,6-heptadiene-3,5-dione 5-Hydroxy-1,7-bis(4-hydroxyphenyl)hepta-1,4,6-trien-3-one CHEMBL105350 bis-demethoxycurcumin curcumin III
TypeSmall organic molecule
Emp. Form.C19H16O4
Mol. Mass.308.3279
SMILESOc1ccc(C=CC(=O)CC(=O)C=Cc2ccc(O)cc2)cc1