Reaction Details
TargetCalcium/calmodulin-dependent protein kinase type II subunit alpha
LigandBDBM50163744
Substrate/Competitorn/a
Meas. Tech.ChEMBL_848197 (CHEMBL2148933)
IC50 24000±n/a nM
Citation Mayadevi, MSherin, DRKeerthi, VSRajasekharan, KNOmkumar, RV Curcumin is an inhibitor of calcium/calmodulin dependent protein kinase II. Bioorg Med Chem20:6040-7 (2012) 
 
Calcium/calmodulin-dependent protein kinase type II subunit alpha
Name:Calcium/calmodulin-dependent protein kinase type II subunit alpha
Type:Enzyme Catalytic Domain
Mol. Mass.:54093.63
Organism:Homo sapiens (Human)
Description:gi_25952118
Residue:478
BDBM50163744
NameBDBM50163744
Synonyms:(1E,4Z,6E)-5-Hydroxy-1-(4-hydroxy-3-methoxy-phenyl)-7-(4-hydroxy-phenyl)-hepta-1,4,6-trien-3-one 1-(4-hydroxy-3-methoxyphenyl)-7-(4-hydroxyphenyl)-1,6-heptadiene-3,5-dione CHEMBL179512 curcumin II | demethoxycurcumin
TypeSmall organic molecule
Emp. Form.C20H18O5
Mol. Mass.338.3539
SMILESCOc1cc(C=CC(=O)CC(=O)C=Cc2ccc(O)cc2)ccc1O