Reaction Details
TargetPotassium voltage-gated channel subfamily H member 2
LigandBDBM50391758
Substrate/Competitorn/a
Meas. Tech.ChEMBL_849681 (CHEMBL2150356)
EC50 15000±n/a nM
Citation Peng, HTalreja, TXin, ZCuervo, JHKumaravel, GHumora, MJXu, LRohde, EGan, LJung, MYShackett, MNChollate, SDunah, AWSnodgrass-Belt, PAArnold, HMTaveras, AGRhodes, KJScannevin, RH Discovery of BIIB042, a Potent, Selective, and Orally Bioavailable ¿-Secretase Modulator. ACS Med Chem Lett2:786-791 (2011) 
 
Potassium voltage-gated channel subfamily H member 2
Name:Potassium voltage-gated channel subfamily H member 2
Type:Multi-pass membrane protein
Mol. Mass.:126672.65
Organism:Homo sapiens (Human)
Description:Q12809
Residue:1159
BDBM50391758
NameBDBM50391758
Synonyms:CHEMBL2146750
TypeSmall organic molecule
Emp. Form.C29H29F4NO2
Mol. Mass.499.5397
SMILESC[C@@H](C(O)=O)c1ccc([C@H](N2CCC(C)CC2)c2ccc(F)cc2)c(c1)-c1ccc(cc1)C(F)(F)F