Reaction Details
TargetCytochrome P450 2D6
LigandBDBM50391758
Substrate/Competitorn/a
Meas. Tech.ChEMBL_849687 (CHEMBL2150362)
IC50>35000±n/a nM
Citation Peng, HTalreja, TXin, ZCuervo, JHKumaravel, GHumora, MJXu, LRohde, EGan, LJung, MYShackett, MNChollate, SDunah, AWSnodgrass-Belt, PAArnold, HMTaveras, AGRhodes, KJScannevin, RH Discovery of BIIB042, a Potent, Selective, and Orally Bioavailable ¿-Secretase Modulator. ACS Med Chem Lett2:786-791 (2011) 
 
Cytochrome P450 2D6
Name:Cytochrome P450 2D6
Type:Protein
Mol. Mass.:55774.82
Organism:Homo sapiens (Human)
Description:P10635
Residue:497
BDBM50391758
NameBDBM50391758
Synonyms:CHEMBL2146750
TypeSmall organic molecule
Emp. Form.C29H29F4NO2
Mol. Mass.499.5397
SMILESC[C@@H](C(O)=O)c1ccc([C@H](N2CCC(C)CC2)c2ccc(F)cc2)c(c1)-c1ccc(cc1)C(F)(F)F