Reaction Details
TargetHydroxycarboxylic acid receptor 1
LigandBDBM50391826
Substrate/Competitorn/a
Meas. Tech.ChEMBL_850283 (CHEMBL2150703)
EC50>1000000±n/a nM
Citation Dvorak, CALiu, CShelton, JKuei, CSutton, SWLovenberg, TWCarruthers, NI Identification of Hydroxybenzoic Acids as Selective Lactate Receptor (GPR81) Agonists with Antilipolytic Effects. ACS Med Chem Lett3:637-639 (2012) 
 
Hydroxycarboxylic acid receptor 1
Name:Hydroxycarboxylic acid receptor 1
Type:PROTEIN
Mol. Mass.:39313.04
Organism:Homo sapiens (Human)
Description:ChEMBL_850283
Residue:346
BDBM50391826
NameBDBM50391826
Synonyms:CHEMBL2146990
TypeSmall organic molecule
Emp. Form.C6H7BO3
Mol. Mass.137.929
SMILESOB(O)c1cccc(O)c1