Reaction Details
TargetTyrosine-protein phosphatase non-receptor type 1
LigandBDBM50346601
Substrate/Competitorn/a
Meas. Tech.ChEMBL_848288 (CHEMBL2149377)
Ki 6000±n/a nM
Citation Ramírez-Espinosa, JJRios, MYLópez-Martínez, SLópez-Vallejo, FMedina-Franco, JLPaoli, PCamici, GNavarrete-Vázquez, GOrtiz-Andrade, REstrada-Soto, S Antidiabetic activity of some pentacyclic acid triterpenoids, role of PTP-1B: in vitro, in silico, and in vivo approaches. Eur J Med Chem46:2243-51 (2011) 
 
Tyrosine-protein phosphatase non-receptor type 1
Name:Tyrosine-protein phosphatase non-receptor type 1
Type:Protein phosphatase
Mol. Mass.:49963.76
Organism:Homo sapiens (Human)
Description:Human recombinant GST-fusion PTP1B (1-435).
Residue:435
BDBM50346601
NameBDBM50346601
Synonyms:NSC-114945 Oleanolic acid US11660306, Example Oleanolic acid
TypeSmall organic molecule
Emp. Form.C30H48O3
Mol. Mass.456.7003
SMILESCC1(C)CC[C@@]2(CC[C@]3(C)C(=CC[C@@H]4[C@@]5(C)CC[C@H](O)C(C)(C)[C@@H]5CC[C@@]34C)[C@@H]2C1)C(O)=O