Reaction Details
TargetReceptor-type tyrosine-protein phosphatase F
LigandBDBM50148911
Substrate/Competitorn/a
Meas. Tech.ChEMBL_848287 (CHEMBL2149376)
IC50 3800±n/a nM
Citation Ramírez-Espinosa, JJRios, MYLópez-Martínez, SLópez-Vallejo, FMedina-Franco, JLPaoli, PCamici, GNavarrete-Vázquez, GOrtiz-Andrade, REstrada-Soto, S Antidiabetic activity of some pentacyclic acid triterpenoids, role of PTP-1B: in vitro, in silico, and in vivo approaches. Eur J Med Chem46:2243-51 (2011) 
 
Receptor-type tyrosine-protein phosphatase F
Name:Receptor-type tyrosine-protein phosphatase F
Type:Protein
Mol. Mass.:212869.85
Organism:Homo sapiens (Human)
Description:P10586
Residue:1907
BDBM50148911
NameBDBM50148911
Synonyms:(3beta)-3-hydroxyurs-12-en-28-oic acid CHEMBL169 malol urson
TypeSmall organic molecule
Emp. Form.C30H48O3
Mol. Mass.456.7003
SMILESC[C@@H]1CC[C@@]2(CC[C@]3(C)C(=CC[C@@H]4[C@@]5(C)CC[C@H](O)C(C)(C)[C@@H]5CC[C@@]34C)[C@@H]2[C@H]1C)C(O)=O