Reaction Details
TargetMicrosomal triglyceride transfer protein large subunit
LigandBDBM50391863
Substrate/Competitorn/a
Meas. Tech.ChEMBL_849013 (CHEMBL2150039)
IC50 0.600000±n/a nM
Citation Robinson, RPBartlett, JABertinato, PBessire, AJCosgrove, JFoley, PMManion, TBMinich, MLRamos, BReese, MRSchmahai, TJSwick, AGTess, DAVaz, AWolford, A Discovery of microsomal triglyceride transfer protein (MTP) inhibitors with potential for decreased active metabolite load compared to dirlotapide. Bioorg Med Chem Lett21:4150-4 (2011) 
 
Microsomal triglyceride transfer protein large subunit
Name:Microsomal triglyceride transfer protein large subunit
Type:PROTEIN
Mol. Mass.:99365.65
Organism:Homo sapiens (Human)
Description:ChEMBL_971724
Residue:894
BDBM50391863
NameBDBM50391863
Synonyms:CHEMBL2147286
TypeSmall organic molecule
Emp. Form.C42H37FN4O3
Mol. Mass.664.7666
SMILESCC(C)c1ccc(cc1)-c1ccccc1C(=O)Nc1ccc2cc(ccc2n1)C(=O)N[C@H](C(=O)N(C)Cc1ccc(F)cc1)c1ccccc1