Reaction Details
TargetMicrosomal triglyceride transfer protein large subunit
LigandBDBM50391864
Substrate/Competitorn/a
Meas. Tech.ChEMBL_849013 (CHEMBL2150039)
IC50 1.2±n/a nM
Citation Robinson, RPBartlett, JABertinato, PBessire, AJCosgrove, JFoley, PMManion, TBMinich, MLRamos, BReese, MRSchmahai, TJSwick, AGTess, DAVaz, AWolford, A Discovery of microsomal triglyceride transfer protein (MTP) inhibitors with potential for decreased active metabolite load compared to dirlotapide. Bioorg Med Chem Lett21:4150-4 (2011) 
 
Microsomal triglyceride transfer protein large subunit
Name:Microsomal triglyceride transfer protein large subunit
Type:PROTEIN
Mol. Mass.:99365.65
Organism:Homo sapiens (Human)
Description:ChEMBL_971724
Residue:894
BDBM50391864
NameBDBM50391864
Synonyms:CHEMBL2147287
TypeSmall organic molecule
Emp. Form.C43H39FN4O3
Mol. Mass.678.7932
SMILESCN(Cc1ccc(F)cc1)C(=O)[C@@H](NC(=O)c1ccc2nc(NC(=O)c3ccccc3-c3ccc(cc3)C(C)(C)C)ccc2c1)c1ccccc1