Reaction Details
TargetMicrosomal triglyceride transfer protein large subunit
LigandBDBM50391878
Substrate/Competitorn/a
Meas. Tech.ChEMBL_849013 (CHEMBL2150039)
IC50 2.8±n/a nM
Citation Robinson, RPBartlett, JABertinato, PBessire, AJCosgrove, JFoley, PMManion, TBMinich, MLRamos, BReese, MRSchmahai, TJSwick, AGTess, DAVaz, AWolford, A Discovery of microsomal triglyceride transfer protein (MTP) inhibitors with potential for decreased active metabolite load compared to dirlotapide. Bioorg Med Chem Lett21:4150-4 (2011) 
 
Microsomal triglyceride transfer protein large subunit
Name:Microsomal triglyceride transfer protein large subunit
Type:PROTEIN
Mol. Mass.:99365.65
Organism:Homo sapiens (Human)
Description:ChEMBL_971724
Residue:894
BDBM50391878
NameBDBM50391878
Synonyms:CHEMBL2147289
TypeSmall organic molecule
Emp. Form.C41H35FN4O4
Mol. Mass.666.7394
SMILESCCOc1ccc(cc1)-c1ccccc1C(=O)Nc1ccc2cc(ccc2n1)C(=O)N[C@H](C(=O)N(C)Cc1ccc(F)cc1)c1ccccc1