Reaction Details
TargetProtein kinase C epsilon type
LigandBDBM50391904
Substrate/Competitorn/a
Meas. Tech.ChEMBL_849741 (CHEMBL2150523)
IC50 13±n/a nM
Citation van Eis, MJEvenou, JPFloersheim, PGaul, CCowan-Jacob, SWMonovich, LRummel, GSchuler, WStark, WStrauss, Avon Matt, AVangrevelinghe, EWagner, JSoldermann, N 2,6-Naphthyridines as potent and selective inhibitors of the novel protein kinase C isozymes. Bioorg Med Chem Lett21:7367-72 (2011) 
 
Protein kinase C epsilon type
Name:Protein kinase C epsilon type
Type:Enzyme
Mol. Mass.:83680.45
Organism:Homo sapiens (Human)
Description:The recombinant human PKC enzymes were produced using a baculovirus expression system in SF9 cells
Residue:737
BDBM50391904
NameBDBM50391904
Synonyms:CHEMBL2147544
TypeSmall organic molecule
Emp. Form.C16H17N5
Mol. Mass.279.3397
SMILESNCCCNc1nc(cc2cnccc12)-c1ccncc1