Reaction Details
TargetHigh affinity nerve growth factor receptor
LigandBDBM50332012
Substrate/Competitorn/a
Meas. Tech.ChEMBL_850936 (CHEMBL2157031)
Kd 145±n/a nM
Citation Hong, SKim, JSeo, JHJung, KHHong, SSHong, S Design, synthesis, and evaluation of 3,5-disubstituted 7-azaindoles as Trk inhibitors with anticancer and antiangiogenic activities. J Med Chem55:5337-49 (2012) 
 
High affinity nerve growth factor receptor
Name:High affinity nerve growth factor receptor
Type:n/a
Mol. Mass.:87498.18
Organism:Homo sapiens (Human)
Description:P04629
Residue:796
BDBM50332012
NameBDBM50332012
Synonyms:CHEMBL1290790 | N-(5-(3-(3,4-dimethoxyphenyl)-1H-pyrrolo[2,3-b]pyridin-5-yl)pyridin-3-yl)benzenesulfonamide
TypeSmall organic molecule
Emp. Form.C26H22N4O4S
Mol. Mass.486.542
SMILESCOc1ccc(cc1OC)-c1c[nH]c2ncc(cc12)-c1cncc(NS(=O)(=O)c2ccccc2)c1