Reaction Details
TargetHigh affinity nerve growth factor receptor
LigandBDBM50332020
Substrate/Competitorn/a
Meas. Tech.ChEMBL_850936 (CHEMBL2157031)
Kd 91±n/a nM
Citation Hong, SKim, JSeo, JHJung, KHHong, SSHong, S Design, synthesis, and evaluation of 3,5-disubstituted 7-azaindoles as Trk inhibitors with anticancer and antiangiogenic activities. J Med Chem55:5337-49 (2012) 
 
High affinity nerve growth factor receptor
Name:High affinity nerve growth factor receptor
Type:n/a
Mol. Mass.:87498.18
Organism:Homo sapiens (Human)
Description:P04629
Residue:796
BDBM50332020
NameBDBM50332020
Synonyms:CHEMBL1289468 | N-(3-(3-(3,4-dimethoxyphenyl)-1H-pyrrolo[2,3-b]pyridin-5-yl)phenyl)benzenesulfonamide
TypeSmall organic molecule
Emp. Form.C27H23N3O4S
Mol. Mass.485.554
SMILESCOc1ccc(cc1OC)-c1c[nH]c2ncc(cc12)-c1cccc(NS(=O)(=O)c2ccccc2)c1