Reaction Details
TargetHigh affinity nerve growth factor receptor
LigandBDBM50391957
Substrate/Competitorn/a
Meas. Tech.ChEMBL_850936 (CHEMBL2157031)
Kd 88±n/a nM
Citation Hong, SKim, JSeo, JHJung, KHHong, SSHong, S Design, synthesis, and evaluation of 3,5-disubstituted 7-azaindoles as Trk inhibitors with anticancer and antiangiogenic activities. J Med Chem55:5337-49 (2012) 
 
High affinity nerve growth factor receptor
Name:High affinity nerve growth factor receptor
Type:n/a
Mol. Mass.:87498.18
Organism:Homo sapiens (Human)
Description:P04629
Residue:796
BDBM50391957
NameBDBM50391957
Synonyms:CHEMBL2152266
TypeSmall organic molecule
Emp. Form.C19H15N3
Mol. Mass.285.3425
SMILESNc1cccc(c1)-c1cnc2[nH]cc(-c3ccccc3)c2c1