Reaction Details
TargetHigh affinity nerve growth factor receptor
LigandBDBM50391958
Substrate/Competitorn/a
Meas. Tech.ChEMBL_850936 (CHEMBL2157031)
Kd 270±n/a nM
Citation Hong, SKim, JSeo, JHJung, KHHong, SSHong, S Design, synthesis, and evaluation of 3,5-disubstituted 7-azaindoles as Trk inhibitors with anticancer and antiangiogenic activities. J Med Chem55:5337-49 (2012) 
 
High affinity nerve growth factor receptor
Name:High affinity nerve growth factor receptor
Type:n/a
Mol. Mass.:87498.18
Organism:Homo sapiens (Human)
Description:P04629
Residue:796
BDBM50391958
NameBDBM50391958
Synonyms:CHEMBL2152267
TypeSmall organic molecule
Emp. Form.C20H14N4
Mol. Mass.310.352
SMILESNc1cccc(c1)-c1cnc2[nH]cc(-c3cccc(c3)C#N)c2c1