Reaction Details
TargetTyrosine-protein kinase JAK1
LigandBDBM50391989
Substrate/Competitorn/a
Meas. Tech.ChEMBL_851246 (CHEMBL2155758)
Ki 3.2±n/a nM
Citation Kulagowski, JJBlair, WBull, RJChang, CDeshmukh, GDyke, HJEigenbrot, CGhilardi, NGibbons, PHarrison, TKHewitt, PRLiimatta, MHurley, CAJohnson, AJohnson, TKenny, JRBir Kohli, PMaxey, RJMendonca, RMortara, KMurray, JNarukulla, RShia, SSteffek, MUbhayakar, SUltsch, Mvan Abbema, AWard, SIWaszkowycz, BZak, M Identification of imidazo-pyrrolopyridines as novel and potent JAK1 inhibitors. J Med Chem55:5901-21 (2012) 
 
Tyrosine-protein kinase JAK1
Name:Tyrosine-protein kinase JAK1
Type:Protein
Mol. Mass.:133293.73
Organism:Homo sapiens (Human)
Description:P23458
Residue:1154
BDBM50391989
NameBDBM50391989
Synonyms:CHEMBL2152424
TypeSmall organic molecule
Emp. Form.C15H17N5O2
Mol. Mass.299.3278
SMILESCOC(=O)N[C@@H]1CC[C@H](C1)n1cnc2cnc3[nH]ccc3c12