Reaction Details
TargetNAD-dependent protein deacetylase sirtuin-1
LigandBDBM50216689
Substrate/Competitorn/a
Meas. Tech.ChEMBL_851435 (CHEMBL2156441)
IC50 30000±n/a nM
Citation Suzuki, TKhan, MNSawada, HImai, EItoh, YYamatsuta, KTokuda, NTakeuchi, JSeko, TNakagawa, HMiyata, N Design, synthesis, and biological activity of a novel series of human sirtuin-2-selective inhibitors. J Med Chem55:5760-73 (2012) 
 
NAD-dependent protein deacetylase sirtuin-1
Name:NAD-dependent protein deacetylase sirtuin-1
Type:Developmental protein; hydrolase
Mol. Mass.:81626.66
Organism:Homo sapiens (Human)
Description:n/a
Residue:747
BDBM50216689
NameBDBM50216689
Synonyms:2-cyano-3-(5-(2,5-dichlorophenyl)furan-2-yl)-N-(quinolin-5-yl)acrylamide | CHEMBL224864
TypeSmall organic molecule
Emp. Form.C23H13Cl2N3O2
Mol. Mass.434.274
SMILESClc1ccc(Cl)c(c1)-c1ccc(\C=C(/C#N)C(=O)Nc2cccc3ncccc23)o1