Reaction Details
TargetHistone deacetylase 4
LigandBDBM50392111
Substrate/Competitorn/a
Meas. Tech.ChEMBL_851450 (CHEMBL2156456)
IC50>30000±n/a nM
Citation Suzuki, TKhan, MNSawada, HImai, EItoh, YYamatsuta, KTokuda, NTakeuchi, JSeko, TNakagawa, HMiyata, N Design, synthesis, and biological activity of a novel series of human sirtuin-2-selective inhibitors. J Med Chem55:5760-73 (2012) 
 
Histone deacetylase 4
Name:Histone deacetylase 4
Type:Enzyme
Mol. Mass.:119049.39
Organism:Homo sapiens (Human)
Description:P56524
Residue:1084
BDBM50392111
NameBDBM50392111
Synonyms:CHEMBL2152613
TypeSmall organic molecule
Emp. Form.C21H20N2O2
Mol. Mass.332.3957
SMILESNC(=O)c1ccccc1Nc1cccc(OCCc2ccccc2)c1