Reaction Details
TargetHistone deacetylase 6
LigandBDBM50392111
Substrate/Competitorn/a
Meas. Tech.ChEMBL_851452 (CHEMBL2156458)
IC50>30000±n/a nM
Citation Suzuki, TKhan, MNSawada, HImai, EItoh, YYamatsuta, KTokuda, NTakeuchi, JSeko, TNakagawa, HMiyata, N Design, synthesis, and biological activity of a novel series of human sirtuin-2-selective inhibitors. J Med Chem55:5760-73 (2012) 
 
Histone deacetylase 6
Name:Histone deacetylase 6
Type:Chromatin regulator; hydrolase; repressor
Mol. Mass.:131381.51
Organism:Homo sapiens (Human)
Description:Q9UBN7
Residue:1215
BDBM50392111
NameBDBM50392111
Synonyms:CHEMBL2152613
TypeSmall organic molecule
Emp. Form.C21H20N2O2
Mol. Mass.332.3957
SMILESNC(=O)c1ccccc1Nc1cccc(OCCc2ccccc2)c1