Reaction Details
TargetNAD-dependent protein deacetylase sirtuin-1
LigandBDBM50297167
Substrate/Competitorn/a
Meas. Tech.ChEMBL_851435 (CHEMBL2156441)
IC50 72000±n/a nM
Citation Suzuki, TKhan, MNSawada, HImai, EItoh, YYamatsuta, KTokuda, NTakeuchi, JSeko, TNakagawa, HMiyata, N Design, synthesis, and biological activity of a novel series of human sirtuin-2-selective inhibitors. J Med Chem55:5760-73 (2012) 
 
NAD-dependent protein deacetylase sirtuin-1
Name:NAD-dependent protein deacetylase sirtuin-1
Type:Developmental protein; hydrolase
Mol. Mass.:81626.66
Organism:Homo sapiens (Human)
Description:n/a
Residue:747
BDBM50297167
NameBDBM50297167
Synonyms:2-[3-(2-Hydroxylethyl)phenylamino]benzamide | CHEMBL572123
TypeSmall organic molecule
Emp. Form.C15H16N2O2
Mol. Mass.256.2997
SMILESNC(=O)c1ccccc1Nc1cccc(CCO)c1