Reaction Details
TargetNAD-dependent protein deacetylase sirtuin-1
LigandBDBM50392086
Substrate/Competitorn/a
Meas. Tech.ChEMBL_851435 (CHEMBL2156441)
IC50>100000±n/a nM
Citation Suzuki, TKhan, MNSawada, HImai, EItoh, YYamatsuta, KTokuda, NTakeuchi, JSeko, TNakagawa, HMiyata, N Design, synthesis, and biological activity of a novel series of human sirtuin-2-selective inhibitors. J Med Chem55:5760-73 (2012) 
 
NAD-dependent protein deacetylase sirtuin-1
Name:NAD-dependent protein deacetylase sirtuin-1
Type:Developmental protein; hydrolase
Mol. Mass.:81626.66
Organism:Homo sapiens (Human)
Description:n/a
Residue:747
BDBM50392086
NameBDBM50392086
Synonyms:CHEMBL2152588
TypeSmall organic molecule
Emp. Form.C21H18N2O
Mol. Mass.314.3804
SMILESNC(=O)c1ccccc1Nc1ccc(\C=C/c2ccccc2)cc1