Reaction Details
TargetNAD-dependent protein deacetylase sirtuin-1
LigandBDBM50392092
Substrate/Competitorn/a
Meas. Tech.ChEMBL_851435 (CHEMBL2156441)
IC50>100000±n/a nM
Citation Suzuki, TKhan, MNSawada, HImai, EItoh, YYamatsuta, KTokuda, NTakeuchi, JSeko, TNakagawa, HMiyata, N Design, synthesis, and biological activity of a novel series of human sirtuin-2-selective inhibitors. J Med Chem55:5760-73 (2012) 
 
NAD-dependent protein deacetylase sirtuin-1
Name:NAD-dependent protein deacetylase sirtuin-1
Type:Developmental protein; hydrolase
Mol. Mass.:81626.66
Organism:Homo sapiens (Human)
Description:n/a
Residue:747
BDBM50392092
NameBDBM50392092
Synonyms:CHEMBL2152594
TypeSmall organic molecule
Emp. Form.C20H17N3O2
Mol. Mass.331.3679
SMILESNC(=O)c1ccccc1Nc1ccc(NC(=O)c2ccccc2)cc1