Reaction Details
TargetNAD-dependent protein deacetylase sirtuin-1
LigandBDBM50392098
Substrate/Competitorn/a
Meas. Tech.ChEMBL_851435 (CHEMBL2156441)
IC50>100000±n/a nM
Citation Suzuki, TKhan, MNSawada, HImai, EItoh, YYamatsuta, KTokuda, NTakeuchi, JSeko, TNakagawa, HMiyata, N Design, synthesis, and biological activity of a novel series of human sirtuin-2-selective inhibitors. J Med Chem55:5760-73 (2012) 
 
NAD-dependent protein deacetylase sirtuin-1
Name:NAD-dependent protein deacetylase sirtuin-1
Type:Developmental protein; hydrolase
Mol. Mass.:81626.66
Organism:Homo sapiens (Human)
Description:n/a
Residue:747
BDBM50392098
NameBDBM50392098
Synonyms:CHEMBL2152600
TypeSmall organic molecule
Emp. Form.C19H16N4O2
Mol. Mass.332.3559
SMILESNC(=O)c1ccccc1Nc1ccc(NC(=O)c2cccnc2)cc1