Reaction Details
TargetNAD-dependent protein deacetylase sirtuin-1
LigandBDBM50392113
Substrate/Competitorn/a
Meas. Tech.ChEMBL_851435 (CHEMBL2156441)
IC50>100000±n/a nM
Citation Suzuki, TKhan, MNSawada, HImai, EItoh, YYamatsuta, KTokuda, NTakeuchi, JSeko, TNakagawa, HMiyata, N Design, synthesis, and biological activity of a novel series of human sirtuin-2-selective inhibitors. J Med Chem55:5760-73 (2012) 
 
NAD-dependent protein deacetylase sirtuin-1
Name:NAD-dependent protein deacetylase sirtuin-1
Type:Developmental protein; hydrolase
Mol. Mass.:81626.66
Organism:Homo sapiens (Human)
Description:n/a
Residue:747
BDBM50392113
NameBDBM50392113
Synonyms:CHEMBL2152615
TypeSmall organic molecule
Emp. Form.C22H22N2O2
Mol. Mass.346.4223
SMILESCc1ccccc1CCOc1cccc(Nc2ccccc2C(N)=O)c1