Reaction Details
TargetPhosphatidylinositol 4,5-bisphosphate 3-kinase catalytic subunit delta isoform
LigandBDBM50392138
Substrate/Competitorn/a
Meas. Tech.ChEMBL_851654 (CHEMBL2157253)
IC50 40±n/a nM
Citation Sutherlin, DPBaker, SBisconte, ABlaney, PMBrown, AChan, BKChantry, DCastanedo, GDePledge, PGoldsmith, PGoldstein, DMHancox, TKaur, JKnowles, DKondru, RLesnick, JLucas, MCLewis, CMurray, JNadin, AJNonomiya, JPang, JPegg, NPrice, SReif, KSafina, BSSalphati, LStaben, SSeward, EMShuttleworth, SSohal, SSweeney, ZKUltsch, MWaszkowycz, BWei, B Potent and selective inhibitors of PI3Kd: obtaining isoform selectivity from the affinity pocket and tryptophan shelf. Bioorg Med Chem Lett22:4296-302 (2012) 
 
Phosphatidylinositol 4,5-bisphosphate 3-kinase catalytic subunit delta isoform
Name:Phosphatidylinositol 4,5-bisphosphate 3-kinase catalytic subunit delta isoform
Type:Enzyme Subunit
Mol. Mass.:119489.41
Organism:Homo sapiens (Human)
Description:O00329
Residue:1044
BDBM50392138
NameBDBM50392138
Synonyms:CHEMBL2152768
TypeSmall organic molecule
Emp. Form.C28H33FN6O2
Mol. Mass.504.599
SMILESCC(C)(O)C1CCN(Cc2ccc3nc(nc(N4CCOCC4)c3n2)-c2c(F)ccc3[nH]ccc23)CC1