Reaction Details
TargetCathepsin F
LigandBDBM50392214
Substrate/Competitorn/a
Meas. Tech.ChEMBL_852645 (CHEMBL2157194)
Ki>4000±n/a nM
Citation Frizler, MSchmitz, JSchulz-Fincke, ACGütschow, M Selective nitrile inhibitors to modulate the proteolytic synergism of cathepsins S and F. J Med Chem55:5982-6 (2012) 
 
Cathepsin F
Name:Cathepsin F
Type:PROTEIN
Mol. Mass.:53373.38
Organism:Homo sapiens (Human)
Description:ChEMBL_852650
Residue:484
BDBM50392214
NameBDBM50392214
Synonyms:CHEMBL2153167
TypeSmall organic molecule
Emp. Form.C15H19N7O4S2
Mol. Mass.425.486
SMILESCC(C)CS(=O)(=O)CC(NC(=O)c1ccc(s1)-c1nnn[nH]1)C(=O)NCC#N