Reaction Details
TargetCathepsin F
LigandBDBM50392205
Substrate/Competitorn/a
Meas. Tech.ChEMBL_852645 (CHEMBL2157194)
Ki>4000±n/a nM
Citation Frizler, MSchmitz, JSchulz-Fincke, ACGütschow, M Selective nitrile inhibitors to modulate the proteolytic synergism of cathepsins S and F. J Med Chem55:5982-6 (2012) 
 
Cathepsin F
Name:Cathepsin F
Type:PROTEIN
Mol. Mass.:53373.38
Organism:Homo sapiens (Human)
Description:ChEMBL_852650
Residue:484
BDBM50392205
NameBDBM50392205
Synonyms:CHEMBL2153168
TypeSmall organic molecule
Emp. Form.C20H23N3O4S2
Mol. Mass.433.544
SMILESCC(C)CS(=O)(=O)CC(NC(=O)c1ccc(cc1)-c1cccs1)C(=O)NCC#N