Reaction Details
TargetCathepsin F
LigandBDBM50392215
Substrate/Competitorn/a
Meas. Tech.ChEMBL_852650 (CHEMBL2156365)
Ki 21±n/a nM
Citation Frizler, MSchmitz, JSchulz-Fincke, ACGütschow, M Selective nitrile inhibitors to modulate the proteolytic synergism of cathepsins S and F. J Med Chem55:5982-6 (2012) 
 
Cathepsin F
Name:Cathepsin F
Type:PROTEIN
Mol. Mass.:53373.38
Organism:Homo sapiens (Human)
Description:ChEMBL_852650
Residue:484
BDBM50392215
NameBDBM50392215
Synonyms:CHEMBL2153161
TypeSmall organic molecule
Emp. Form.C17H24N4O4S
Mol. Mass.380.462
SMILESCC(C)CS(=O)(=O)C[C@H](NC(=O)c1ccccc1)C(=O)N(C)N(C)C#N