Reaction Details
TargetHydroxysteroid 11-beta dehydrogenase 1
LigandBDBM50392216
Substrate/Competitorn/a
Meas. Tech.ChEMBL_850498 (CHEMBL2157619)
IC50 3770±n/a nM
Citation Scott, JSBowker, SSDeschoolmeester, JGerhardt, SHargreaves, DKilgour, ELloyd, AMayers, RMMcCoull, WNewcombe, NJOgg, DPacker, MJRees, ARevill, JSchofield, PSelmi, NSwales, JGWhittamore, PR Discovery of a potent, selective, and orally bioavailable acidic 11ß-hydroxysteroid dehydrogenase type 1 (11ß-HSD1) inhibitor: discovery of 2-[(3S)-1-[5-(cyclohexylcarbamoyl)-6-propylsulfanylpyridin-2-yl]-3-piperidyl]acetic acid (AZD4017). J Med Chem55:5951-64 (2012) 
 
Hydroxysteroid 11-beta dehydrogenase 1
Name:Hydroxysteroid 11-beta dehydrogenase 1
Synonyms:11-beta-hydroxysteroid dehydrogenase type 1
Type:PROTEIN
Mol. Mass.:32020.70
Organism:Canis familiaris
Description:ChEMBL_850498
Residue:293
BDBM50392216
NameBDBM50392216
TypeSmall organic molecule
Emp. Form.C22H33N3O3S
Mol. Mass.419.581
SMILESCCCSc1nc(ccc1C(=O)NC1CCCCC1)N1CCC[C@@H](CC(O)=O)C1