Reaction Details
TargetHypoxanthine-guanine phosphoribosyltransferase
LigandBDBM50392252
Substrate/Competitorn/a
Meas. Tech.ChEMBL_850551 (CHEMBL2157773)
Ki 29000±n/a nM
Citation Hocková, DKeough, DTJaneba, ZWang, THde Jersey, JGuddat, LW Synthesis of novel N-branched acyclic nucleoside phosphonates as potent and selective inhibitors of human, Plasmodium falciparum and Plasmodium vivax 6-oxopurine phosphoribosyltransferases. J Med Chem55:6209-23 (2012) 
 
Hypoxanthine-guanine phosphoribosyltransferase
Name:Hypoxanthine-guanine phosphoribosyltransferase
Type:Protein
Mol. Mass.:24579.61
Organism:Homo sapiens (Human)
Description:P00492
Residue:218
BDBM50392252
NameBDBM50392252
Synonyms:CHEMBL2153491
TypeSmall organic molecule
Emp. Form.C13H19N6O4P
Mol. Mass.354.3015
SMILESOP(O)(=O)CCN(CCCC#N)CCn1cnc2c1nc[nH]c2=O